"primaryid","caseid","i_f_code","i_f_code_num","foll_seq","image","event_dt","event_dt_num","mfr_dt","mfr_dt_num","fda_dt","fda_dt_num","rept_cod","rept_cod_num","mfr_num","mfr_sndr","age","age_cod","sex","e_sub","wt","wt_cod","rept_dt","rept_dt_num","occp_cod","death_dt","to_mfr","confid","reporter_country","occp_cod_num"
4871816,5954145,"I",72,,"4871816-2",20051208,12/8/2005,20051222,12/22/2005,20060104,1/4/2006,"EXP",698880,"FR-JNJFOC-20051203832","JOHNSON + JOHNSON PHARMACEUTICAL",,,"F","Y",54.2000007629395,"KG",20060104,1/4/2006,"MD",,,,"FRANCE",7768
4873860,5938848,"F",70,"2","4873860-8",,,20051208,12/8/2005,20060104,1/4/2006,"EXP",698880,"USA050494672","ELI LILLY AND COMPANY",51,"YR","M","N",62.2999992370605,"KG",20051214,12/14/2005,"CN",,,,"UNITED STATES",6778
4875293,5925028,"F",70,,"4875293-7",20051019,10/19/2005,20051229,12/29/2005,20060104,1/4/2006,"EXP",698880,"TCI2005A04414","TAKEDA PHARMACEUTICALS COMPANY LTD.",77,"YR","F","N",,,20051229,12/29/2005,"OT",,,,"JAPAN",7984
4876895,6106948,"I",72,,"4876895-4",20051207,12/7/2005,,,20060109,1/9/2006,"DIR",687382,,,63,"YR","F","N",94.1999969482422,"KG",20060106,1/6/2006,"OT",20051213,"N","N","UNITED STATES",7984
4879673,6134423,"F",70,"1","4879673-5",20031209,12/9/2003,20051228,12/28/2005,20060111,1/11/2006,"EXP",698880,"2006P1000005","PDL BIOPHARMA, INC.",77,"YR","M","N",,,20060110,1/10/2006,,,,,"UNITED KINGDOM",
4880132,5954145,"I",72,,"4880132-4",20051208,12/8/2005,20051219,12/19/2005,20060113,1/13/2006,"EXP",698880,"FR-JNJFOC-20051203832","JOHNSON + JOHNSON PHARMACEUTICAL",,,"F","Y",54.2000007629395,"KG",20060113,1/13/2006,"MD",,,,"FRANCE",7768
4880268,5962271,"I",72,,"4880268-8",20050828,8/28/2005,20060103,1/3/2006,20060113,1/13/2006,"EXP",698880,"US-ABBOTT-06P-163-0321084-00","ABBOTT",,,"M","Y",101,"KG",20060113,1/13/2006,,,,,"UNITED STATES",
4880781,5840705,"F",70,"1","4880781-3",20040819,8/19/2004,20050329,3/29/2005,20060111,1/11/2006,"PER",806982,"2005S1000119","CUBIST PHARMACEUTICALS INC",21,"YR",,"N",,,20050912,9/12/2005,"MD",,,,"UNITED STATES",7768
4881857,6111657,"I",72,,"4881857-7",,,,,20060112,1/12/2006,"DIR",687382,,,14,"YR","M","N",145,"LBS",20060111,1/11/2006,"CN",20041021,"N","N","UNITED STATES",6778
4886032,5969281,"I",72,,"4886032-8",20051018,10/18/2005,20060105,1/5/2006,20060117,1/17/2006,"EXP",698880,"2006-01-0274","SCHERING-PLOUGH CORPORATION",49,"YR","F","N",60,"KG",20060105,1/5/2006,"MD",,,,"FRANCE",7768
4886058,6083974,"I",72,,"4886058-4",20041101,11/1/2004,20060106,1/6/2006,20060117,1/17/2006,"EXP",698880,"2006-01-0328","SCHERING-PLOUGH CORPORATION",,,"F","N",,,20060106,1/6/2006,"OT",20041101,,,"UNITED KINGDOM",7984
4886545,5999431,"I",72,,"4886545-9",20041001,10/1/2004,20060110,1/10/2006,20060118,1/18/2006,"EXP",698880,"2006BI000512","BIOGEN IDEC INC.",57,"YR","M","N",,,20060117,1/17/2006,,,,,"UNITED STATES",
4890042,6146003,"I",72,,"4890042-4",,,20060104,1/4/2006,20060120,1/20/2006,"EXP",698880,"DSA_27640_2006","BIOVAIL PHARMACEUTICALS  INC.",78,"YR","F","N",,,20060119,1/19/2006,"MD",,,,"GREECE",7768
4890498,6103182,"I",72,,"4890498-7",20041002,10/2/2004,,,20060123,1/23/2006,"DIR",687382,,,65.370002746582,"YR","F","N",,,20060123,1/23/2006,"MD",,"N","N","UNITED STATES",7768
4890632,6109419,"I",72,,"4890632-9",,,20060102,1/2/2006,20060120,1/20/2006,"EXP",698880,"UKO06000002","PROCTER + GAMBLE REGULATORY AFFAIRS",19,"YR","F","N",,,20060104,1/4/2006,"OT",,,,"FRANCE",7984
4890910,6132009,"I",72,,"4890910-3",20010530,5/30/2001,20060117,1/17/2006,20060123,1/23/2006,"EXP",698880,"006453","BARR LABORATORIES",,,"F","N",,,20060120,1/20/2006,"LW",,,,"UNITED STATES",7687
4893637,5964402,"F",70,,"4893637-7",,,20050907,9/7/2005,20060127,1/27/2006,"EXP",698880,"AU-ABBOTT-05P-008-0310591-00","ABBOTT",51,"YR","M","Y",,,20060127,1/27/2006,,,,,"AUSTRALIA",
4895604,5937177,"F",70,"1","4895604-6",20051022,10/22/2005,20060111,1/11/2006,20060125,1/25/2006,"EXP",698880,"8012951","UCB PHARMA, INC.",16,"YR","M","N",62,"KG",20060113,1/13/2006,"CN",,,,"UNITED STATES",6778
4895617,5976667,"I",72,,"4895617-4",20060103,1/3/2006,20060113,1/13/2006,20060125,1/25/2006,"EXP",698880,"230254K06USA","SERONO INC.",45,"YR","F","N",64.4000015258789,"KG",20060120,1/20/2006,,,,,"UNITED STATES",
4896320,5955249,"F",70,"3","4896320-7",20040114,1/14/2004,20060113,1/13/2006,20060126,1/26/2006,"EXP",698880,"310014M05FRA","SERONO INC.",23,"YR","F","N",,,20060125,1/25/2006,"MD",,,,"FRANCE",7768
4896528,5973367,"I",72,,"4896528-0",20051210,12/10/2005,20060119,1/19/2006,20060131,1/31/2006,"EXP",698880,"FR-GLAXOSMITHKLINE-B0407582A","GLAXOSMITHKLINE",50,"YR","M","Y",73,"KG",20060131,1/31/2006,"CN",,,,"FRANCE",6778
4897204,6111154,"I",72,,"4897204-0",20041101,11/1/2004,20060116,1/16/2006,20060127,1/27/2006,"EXP",698880,"DEWYE300616JAN06","WYETH PHARMACEUTICALS INC.",37,"YR","F","N",,,20060126,1/26/2006,"OT",,,,"GERMANY",7984
4897391,6109476,"I",72,,"4897391-4",,,,,20060130,1/30/2006,"DIR",687382,,,21,"YR",,"N",110,"LBS",20060124,1/24/2006,"OT",,"N","Y","UNITED STATES",7984
4897586,6107678,"I",72,,"4897586-X",20051108,11/8/2005,,,20060130,1/30/2006,"DIR",687382,,,75,"YR","M","N",72,"KG",20051127,11/27/2005,"PH",,"N","Y","UNITED STATES",8072
4899114,5952917,"F",70,"2","4899114-1",20050916,9/16/2005,20060105,1/5/2006,20060126,1/26/2006,"EXP",698880,"2005BH002173","BAXTER HEALTHCARE CORPORATION",51,"YR","M","N",91.4000015258789,"KG",20060123,1/23/2006,"MD",,,,"UNITED KINGDOM",7768
4899422,6092443,"I",72,,"4899422-4",20051102,11/2/2005,20060123,1/23/2006,20060202,2/2/2006,"EXP",698880,"SE-ABBOTT-06P-150-0323207-00","ABBOTT",65,"YR","M","Y",,,20060202,2/2/2006,,,,,"SWEDEN",
4900345,6083978,"F",70,,"4900345-2",20051030,10/30/2005,20060130,1/30/2006,20060203,2/3/2006,"EXP",698880,"GB-GLAXOSMITHKLINE-B0408444A","GLAXOSMITHKLINE",41,"YR","F","Y",1,"KG",20060203,2/3/2006,"CN",,,,"UNITED KINGDOM",6778
4900694,6099476,"I",72,,"4900694-8",20051211,12/11/2005,20060120,1/20/2006,20060201,2/1/2006,"EXP",698880,"KII-2006-0020872","PURDUE PHARMA L.P.",44,"YR","M","N",,,20060131,1/31/2006,"OT",,,,"UNITED STATES",7984
4901214,6106935,"I",72,,"4901214-4",20050101,1/1/2005,20060120,1/20/2006,20060202,2/2/2006,"EXP",698880,"2006011763","PFIZER INC.",11,"YR","M","N",110,"LBS",20060201,2/1/2006,"CN",,,,"UNITED STATES",6778
4902428,6079388,"I",72,,"4902428-X",20051220,12/20/2005,20060105,1/5/2006,20060130,1/30/2006,"EXP",698880,"1676815-2006-00001","SOUTH TEXAS BLOOD + TISSUE CENTER",33,"YR","M","N",,,20060120,1/20/2006,"OT",,,,"UNITED STATES",7984
4902555,6132061,"I",72,,"4902555-7",19990601,6/1/1999,20050210,2/10/2005,20060113,1/13/2006,"PER",806982,"HQWYE271811FEB05","WYETH PHARMACEUTICALS INC.",,,"F","N",,,20051223,12/23/2005,"LW",,,,"UNITED STATES",7687
4902760,5736686,"F",70,"1","4902760-X",20010125,1/25/2001,20050524,5/24/2005,20060113,1/13/2006,"PER",806982,"HQWYE597726AUG04","WYETH PHARMACEUTICALS INC.",66,"YR","F","N",65.8300018310547,"KG",20051223,12/23/2005,"LW",,,,"UNITED STATES",7687
4903098,6132059,"I",72,,"4903098-7",20020501,5/1/2002,20050601,6/1/2005,20060113,1/13/2006,"PER",806982,"HQWYE213803JUN05","WYETH PHARMACEUTICALS INC.",,,"F","N",,,20051223,12/23/2005,"LW",,,,"UNITED STATES",7687
4903142,5726573,"F",70,"1","4903142-7",20020501,5/1/2002,20050121,1/21/2005,20060113,1/13/2006,"PER",806982,"HQWYE208917JUL04","WYETH PHARMACEUTICALS INC",57,"YR","F","N",876.219970703125,"KG",20051223,12/23/2005,"CN",,,,"UNITED STATES",6778
4903642,6134422,"I",72,,"4903642-X",20050804,8/4/2005,20060120,1/20/2006,20060203,2/3/2006,"EXP",698880,"2006P1000051","PDL BIOPHARM, INC.",55,"YR",,"N",,,20060202,2/2/2006,,,,,"UNITED STATES",
4905537,6132110,"I",72,,"4905537-4",20010401,4/1/2001,20050706,7/6/2005,20060113,1/13/2006,"PER",806982,"HQWYE045608JUL05","WYETH PHARMACEUTICALS INC.",,,"F","N",,,20051223,12/23/2005,"LW",,,,"UNITED STATES",7687
4905822,6132108,"I",72,,"4905822-6",19990722,7/22/1999,20050630,6/30/2005,20060113,1/13/2006,"PER",806982,"HQWYE970405JUL05","WYETH PHARMACEUTICALS INC.",,,"F","N",,,20051223,12/23/2005,"LW",,,,"UNITED STATES",7687
4906114,6110195,"I",72,,"4906114-1",20060203,2/3/2006,,,20060207,2/7/2006,"DIR",687382,,,38,"YR","F","N",154,"LBS",20060206,2/6/2006,"CN",,"Y","N","UNITED STATES",6778
4906164,6109481,"I",72,,"4906164-5",20051207,12/7/2005,,,20060207,2/7/2006,"DIR",687382,,,75,"YR","F","N",65,"KG",20060202,2/2/2006,"MD",,"N","Y","UNITED STATES",7768
4906420,5958291,"F",70,"2","4906420-0",20051215,12/15/2005,20060130,1/30/2006,20060206,2/6/2006,"EXP",698880,"220528","GENENTECH, INC.",43,"YR","F","N",77.0999984741211,"KG",20060203,2/3/2006,"MD",,,,"UNITED STATES",7768
4906426,6083861,"I",72,,"4906426-1",20060125,1/25/2006,20060127,1/27/2006,20060206,2/6/2006,"EXP",698880,"221527","GENENTECH, INC.",41,"YR","F","N",,,20060203,2/3/2006,"MD",,,,"UNITED STATES",7768
4906610,5961290,"F",70,,"4906610-7",20050101,1/1/2005,20060105,1/5/2006,20060209,2/9/2006,"EXP",698880,"FR-GLAXOSMITHKLINE-B0406052A","GLAXOSMITHKLINE",76,"YR","F","Y",61,"KG",20060209,2/9/2006,"CN",,,,"FRANCE",6778
4907040,3939641,"F",70,"6","4907040-4",,,20060119,1/19/2006,20060207,2/7/2006,"EXP",698880,"US97014300A","ELI LILLY AND COMPANY",51,"YR","M","N",70,"KG",20060125,1/25/2006,"CN",,,,"UNITED STATES",6778
4907985,5935702,"F",70,"1","4907985-5",20051104,11/4/2005,20060204,2/4/2006,20060207,2/7/2006,"EXP",698880,"219358","GENENTECH, INC.",52,"YR","F","N",81,"KG",20060206,2/6/2006,"OT",,,,"UNITED STATES",7984
4907989,5892670,"F",70,"3","4907989-2",20050919,9/19/2005,20060204,2/4/2006,20060207,2/7/2006,"EXP",698880,"217828","GENENTECH, INC.",45,"YR","F","N",,,20060206,2/6/2006,"OT",,,,"UNITED STATES",7984
4909067,6092443,"F",70,,"4909067-5",20051102,11/2/2005,20060123,1/23/2006,20060213,2/13/2006,"EXP",698880,"SE-ABBOTT-06P-150-0323207-00","ABBOTT",65,"YR","M","Y",,,20060210,2/10/2006,,,,,"SWEDEN",
4909841,5992019,"I",72,,"4909841-5",20060114,1/14/2006,20060131,1/31/2006,20060208,2/8/2006,"EXP",698880,"221629","GENENTECH, INC.",49,"YR","F","N",111.099998474121,"KG",20060207,2/7/2006,"MD",,,,"UNITED STATES",7768
4909843,5991785,"I",72,,"4909843-9",20060101,1/1/2006,20060201,2/1/2006,20060208,2/8/2006,"EXP",698880,"221679","GENENTECH, INC.",59,"YR","M","N",,,20060207,2/7/2006,"MD",,,,"UNITED STATES",7768
4911459,5988968,"I",72,,"4911459-5",20031203,12/3/2003,20051108,11/8/2005,20060113,1/13/2006,"PER",806982,"HQWYE484410NOV05","WYETH PHARMACEUTICALS INC.",,,"F","N",,,20051223,12/23/2005,"LW",,,,"UNITED STATES",7687
4911621,6011774,"I",72,,"4911621-1",20060116,1/16/2006,20060130,1/30/2006,20060213,2/13/2006,"EXP",698880,"HQWYE645703FEB06","WYETH PHARMACEUTICALS INC",71,"YR","M","N",,,20060210,2/10/2006,,,,,"UNITED STATES",
4912763,5987693,"F",70,"1","4912763-7",20060101,1/1/2006,20060130,1/30/2006,20060213,2/13/2006,"EXP",698880,"220769","GENENTECH, INC.",56,"YR",,"N",94,"KG",20060210,2/10/2006,"MD",20060121,,,"CZECH REPUBLIC",7768
4912845,6089446,"I",72,,"4912845-X",20021101,11/1/2002,20041122,11/22/2004,20060113,1/13/2006,"PER",806982,"HQWYE684124NOV04","WYETH PHARMACEUTICALS INC.",,,"F","N",,,20051223,12/23/2005,,,,,"UNITED STATES",
4913151,6089307,"I",72,,"4913151-X",,,20041229,12/29/2004,20060113,1/13/2006,"PER",806982,"HQWYE375404JAN05","WYETH PHARMACEUTICALS INC.",,,"F","N",,,20051223,12/23/2005,,,,,"UNITED STATES",
4913265,6132105,"I",72,,"4913265-4",,,20041229,12/29/2004,20060113,1/13/2006,"PER",806982,"HQWYE376804JAN05","WYETH PHARMACEUTICALS INC.",,,"F","N",,,20051223,12/23/2005,"LW",,,,"UNITED STATES",7687
4913406,6132104,"I",72,,"4913406-9",19990501,5/1/1999,20050323,3/23/2005,20060113,1/13/2006,"PER",806982,"HQWYE411428MAR05","WYETH PHARMACEUTICALS INC",,,"F","N",,,20051223,12/23/2005,,,,,"UNITED STATES",
4913596,6084682,"I",72,,"4913596-8",20060127,1/27/2006,,,20060214,2/14/2006,"DIR",687382,,,51,"YR","F","N",,,20060213,2/13/2006,"PH",,"Y","N","UNITED STATES",8072
4913990,6084901,"I",72,,"4913990-5",20051101,11/1/2005,20060202,2/2/2006,20060210,2/10/2006,"EXP",698880,"2006BI002201","BIOGEN IDEC INC.",35,"YR","F","N",,,20060209,2/9/2006,"CN",,,,"UNITED STATES",6778
4914237,6106937,"I",72,,"4914237-6",20051115,11/15/2005,20060127,1/27/2006,20060213,2/13/2006,"EXP",698880,"13350","MAYNE PHARMA PTY LTD.",10,"YR","M","N",,,20060211,2/11/2006,"OT",,,,"UNITED KINGDOM",7984
4914479,5846803,"F",70,"1","4914479-X",20050501,5/1/2005,20051024,10/24/2005,20060113,1/13/2006,"PER",806982,"2005SP001135","SEPRACOR INC",52,"YR","F","N",180,"LBS",20060105,1/5/2006,"CN",,,,"UNITED STATES",6778
4916451,5957392,"F",70,,"4916451-2",20050815,8/15/2005,20051230,12/30/2005,20060220,2/20/2006,"EXP",698880,"SE-ABBOTT-06P-150-0321146-00","ABBOTT",,,"M","Y",,,20060220,2/20/2006,"OT",,,,"SWEDEN",7984
4918152,6083767,"I",72,,"4918152-3",19960401,4/1/1996,20051117,11/17/2005,20060215,2/15/2006,"EXP",698880,"MK200602-0135-1","MALLINCKRODT INC",48,"YR","M","N",,,20060213,2/13/2006,"MD",,,,"ITALY",7768
4918169,5966944,"F",70,"1","4918169-9",20051229,12/29/2005,20060202,2/2/2006,20060215,2/15/2006,"EXP",698880,"220802","GENENTECH, INC",40,"YR","M","N",77,"KG",20060214,2/14/2006,"MD",,,,"AUSTRALIA",7768
4918540,6107680,"I",72,,"4918540-5",,,,,20060221,2/21/2006,"DIR",687382,,,54,"YR","M","N",180,"LBS",20060220,2/20/2006,"CN",,"Y","N","UNITED STATES",6778
4922504,5933795,"F",70,,"4922504-5",,,20050804,8/4/2005,20060224,2/24/2006,"EXP",698880,"US-ROCHE-413334","ROCHE",1,"HR","M","Y",0.5,"KG",20060224,2/24/2006,"CN",,,,"UNITED STATES",6778
4923088,5736973,"F",70,"1","4923088-8",20000530,5/30/2000,20051024,10/24/2005,20060113,1/13/2006,"PER",806982,"HQWYE092526OCT04","WYETH PHARMACEUTICALS INC.",58,"YR","F","N",54.4799995422363,"KG",20051223,12/23/2005,,,,,"UNITED STATES",
4923814,6137004,"I",72,,"4923814-8",20020619,6/19/2002,20030919,9/19/2003,20060227,2/27/2006,"EXP",698880,"EMADSS2002004003","JOHNSON + JOHNSON PHARMACEUTICAL",,,"F","Y",50,"KG",20060227,2/27/2006,"MD",20020705,,,"UNITED KINGDOM",7768
4927879,5949581,"F",70,,"4927879-9",20051130,11/30/2005,20051219,12/19/2005,20060228,2/28/2006,"EXP",698880,"NL-GLAXOSMITHKLINE-B0404435A","GLAXOSMITHKLINE",71,"YR","M","Y",,,20060228,2/28/2006,"CN",,,,"NETHERLANDS",6778
4931775,6146005,"I",72,,"4931775-0",20060126,1/26/2006,20060224,2/24/2006,20060303,3/3/2006,"EXP",698880,"GB-AVENTIS-200611167EU","AVENTIS PHARMACEUTICALS, INC.",64,"YR","M","Y",,,20060303,3/3/2006,,,,,,
4932631,6083942,"I",72,,"4932631-4",20060126,1/26/2006,20060222,2/22/2006,20060301,3/1/2006,"EXP",698880,"200610194BFR","BAYER PHARMACEUTICALS CORPORATION",45,"YR","M","N",70,"KG",20060228,2/28/2006,,,,,"FRANCE",
4932869,6146018,"I",72,,"4932869-6",20051101,11/1/2005,,,20060302,3/2/2006,"DIR",687382,,,57,"YR","M","N",,,20060301,3/1/2006,"OT",,"N","Y","UNITED STATES",7984
4940914,6083904,"I",72,,"4940914-7",20051221,12/21/2005,20060302,3/2/2006,20060313,3/13/2006,"EXP",698880,"US-JNJFOC-20060300938","JOHNSON + JOHNSON PHARMACEUTICAL",,,"F","Y",,,20060313,3/13/2006,"MD",,,,"UNITED STATES",7768
4941873,6010036,"I",72,,"4941873-3",20050604,6/4/2005,20060222,2/22/2006,20060308,3/8/2006,"EXP",698880,"051129-0001103","OVATION PHARMACEUTICALS INC",14,"YR","M","N",,,20060306,3/6/2006,"MD",,,,"JAPAN",7768
4942652,5962306,"F",70,"2","4942652-3",,,20060227,2/27/2006,20060308,3/8/2006,"EXP",698880,"200610014BFR","BAYER PHARMACEUTICALS CORPORATION",10,"YR","F","N",,,20060307,3/7/2006,,,,,"FRANCE",
4943352,6079388,"F",70,"29","4943352-6",20051220,12/20/2005,20060105,1/5/2006,20060214,2/14/2006,"EXP",698880,"1676815-2006-00001","SOUTH TEXAS BLOOD + TISSUE CENTER",33,"YR","M","N",,,20060203,2/3/2006,"OT",,,,"UNITED STATES",7984
4943520,6083904,"I",72,,"4943520-3",20051221,12/21/2005,20060302,3/2/2006,20060314,3/14/2006,"EXP",698880,"US-JNJFOC-20060300938","MCNEIL CONSUMER PRODUCTS USA REGULATORY REPORTING",,,"F","Y",,,20060314,3/14/2006,"MD",,,,"UNITED STATES",7768
4943744,6005020,"F",70,"1","4943744-5",20060108,1/8/2006,20060228,2/28/2006,20060310,3/10/2006,"EXP",698880,"2006017877","PFIZER INC",92,"YR","F","N",,,20060309,3/9/2006,"MD",,,,"GERMANY",7768
4943984,6135291,"I",72,,"4943984-5",20060306,3/6/2006,,,20060313,3/13/2006,"DIR",687382,,,,,"M","N",92,"KG",20060309,3/9/2006,"OT",,"N","N","UNITED STATES",7984
4943987,6135289,"I",72,,"4943987-0",20060302,3/2/2006,,,20060313,3/13/2006,"DIR",687382,,,,,"M","N",106,"LBS",20060304,3/4/2006,"OT",,"N","N","UNITED STATES",7984
4944134,6111618,"I",72,,"4944134-1",,,20060222,2/22/2006,20060309,3/9/2006,"EXP",698880,"006669","BARR LABORATORIES",18,"YR","F","N",55.2999992370605,"KG",20060307,3/7/2006,"OT",,,,"UNITED STATES",7984
4944659,5729269,"F",70,"1","4944659-9",20020529,5/29/2002,20050105,1/5/2005,20060113,1/13/2006,"PER",806982,"HQWYE295121JUL04","WYETH PHARMACEUTICALS INC.",55,"YR","F","N",68.0999984741211,"KG",20051223,12/23/2005,,,,,"UNITED STATES",
4944674,5734551,"F",70,"1","4944674-5",20000901,9/1/2000,20050309,3/9/2005,20060113,1/13/2006,"PER",806982,"HQWYE832003SEP04","WYETH PHARMACEUTICALS INC.",45,"YR","F","N",54.4799995422363,"KG",20051223,12/23/2005,,,,,"UNITED STATES",
4944954,6096389,"I",72,,"4944954-3",20041201,12/1/2004,20041206,12/6/2004,20060117,1/17/2006,"PER",806982,"A03200404109","SANOFI-SYNTHELABO, INC.",,,"F","N",,,20051221,12/21/2005,"MD",,,,"UNITED STATES",7768
4945262,6125534,"I",72,,"4945262-7",,,20060306,3/6/2006,20060316,3/16/2006,"EXP",698880,"AU-BRISTOL-MYERS SQUIBB COMPANY-13303854","BRISTOL-MYERS SQUIBB COMPANY",,,"M","Y",,,20060316,3/16/2006,"CN",,,,"AUSTRALIA",6778
4945881,6096388,"I",72,,"4945881-8",20041101,11/1/2004,20041217,12/17/2004,20060117,1/17/2006,"PER",806982,"A03200404291","SANOFI-SYNTHELABO, INC",83,"YR","F","N",140,"LBS",20051221,12/21/2005,"CN",,,,"UNITED STATES",6778
4945886,6096387,"I",72,,"4945886-7",,,20041221,12/21/2004,20060117,1/17/2006,"PER",806982,"A03200500013","SANOFI-SYNTHELABO, INC",,,"M","N",,,20051221,12/21/2005,"MD",,,,"UNITED STATES",7768
4947495,6106940,"I",72,,"4947495-2",20030101,1/1/2003,20060222,2/22/2006,20060314,3/14/2006,"EXP",698880,"DE200602004695","ELI LILLY AND COMPANY",33,"YR","F","N",,,20060301,3/1/2006,,,,,"GERMANY",
4948790,5992534,"F",70,"1","4948790-3",20060115,1/15/2006,20060303,3/3/2006,20060315,3/15/2006,"EXP",698880,"2006US000206","ASTELLAS PHARMA US, INC.",51,"YR","M","N",,,20060310,3/10/2006,"MD",,,,"UNITED STATES",7768
4949019,6014222,"I",72,,"4949019-2",,,20060306,3/6/2006,20060316,3/16/2006,"EXP",698880,"2006033678","PFIZER INC",61,"YR","F","N",202,"LBS",20060315,3/15/2006,"CN",,,,"UNITED STATES",6778
4950147,6015317,"I",72,,"4950147-6",20030101,1/1/2003,20060302,3/2/2006,20060315,3/15/2006,"EXP",698880,"200610225BFR","BAYER PHARMACEUTICALS CORPORATION",74,"YR","M","N",,,20060314,3/14/2006,,,,,"FRANCE",
4950174,5962306,"F",70,"3","4950174-9",20020101,1/1/2002,20060310,3/10/2006,20060316,3/16/2006,"EXP",698880,"200610014BFR","BAYER PHARMACEUTICALS CORPORATION",10,"YR","F","N",,,20060315,3/15/2006,,,,,"FRANCE",
4950981,5953891,"I",72,,"4950981-2",,,20051229,12/29/2005,20060315,3/15/2006,"EXP",698880,"CA_050708421","ELI LILLY AND COMPANY",19,"YR","M","N",95.5,"KG",20060309,3/9/2006,"LW",,,,"CANADA",7687
4951248,6005023,"F",70,"1","4951248-9",20051010,10/10/2005,20060314,3/14/2006,20060317,3/17/2006,"EXP",698880,"20060004USST","SIGMA-TAU PHARMACEUTICAL INC",56,"YR","F","N",,,20060316,3/16/2006,,,,,"FRANCE",
4951340,5952248,"F",70,"5","4951340-9",20051001,10/1/2005,20060310,3/10/2006,20060317,3/17/2006,"EXP",698880,"200510833BFR","BAYER PHARMACEUTICALS CORPORATION",52,"YR","M","N",,,20060316,3/16/2006,,,,,"FRANCE",
4951354,5973066,"F",70,"1","4951354-9",20041231,12/31/2004,20060310,3/10/2006,20060317,3/17/2006,"EXP",698880,"200610035BFR","BAYER PHARMACEUTICALS CORPORATION",35,"YR","F","N",,,20060316,3/16/2006,,,,,"FRANCE",
4951908,6083955,"I",72,,"4951908-X",,,20060306,3/6/2006,20060320,3/20/2006,"EXP",698880,"200610246BFR","BAYER PHARMACEUTICALS CORPORATION",,,,"N",,,20060317,3/17/2006,,,,,"FRANCE",
4951909,6083942,"F",70,"1","4951909-1",20060126,1/26/2006,20060307,3/7/2006,20060320,3/20/2006,"EXP",698880,"200610194BFR","BAYER PHARMACEUTICALS CORPORATION",45,"YR","M","N",70,"KG",20060317,3/17/2006,,,,,"FRANCE",
4952259,5954278,"F",70,"3","4952259-X",20031020,10/20/2003,20060302,3/2/2006,20060314,3/14/2006,"EXP",698880,"HQWYE788201DEC05","WYETH PHARMACEUTICALS INC.",4,"YR","M","N",24.8999996185303,"KG",20060313,3/13/2006,"MD",,,,"UNITED STATES",7768
4952857,5999637,"F",70,"2","4952857-3",20060209,2/9/2006,20060310,3/10/2006,20060321,3/21/2006,"EXP",698880,"EM2006-0091","CHIRON CORPORATION",22,"MON","M","N",,,20060320,3/20/2006,"MD",,,,"GERMANY",7768
4952909,6017835,"I",72,,"4952909-8",,,20060306,3/6/2006,20060321,3/21/2006,"EXP",698880,"2006000548","OSI PHARMACEUTICALS",55,"YR","F","N",,,20060320,3/20/2006,"MD",20060207,,,"FINLAND",7768
4954723,6018947,"I",72,,"4954723-6",20060201,2/1/2006,20060315,3/15/2006,20060322,3/22/2006,"EXP",698880,"200610251BFR","BAYER PHARMACEUTICALS CORPORATION",,,"M","N",75,"KG",20060321,3/21/2006,,,,,"FRANCE",
4954724,6018982,"I",72,,"4954724-8",20060211,2/11/2006,20060315,3/15/2006,20060322,3/22/2006,"EXP",698880,"200610254BFR","BAYER PHARMACEUTICALS CORPORATION",76,"YR","M","N",,,20060321,3/21/2006,,20060215,,,"FRANCE",
4954725,6083956,"I",72,,"4954725-X",20040818,8/18/2004,20060315,3/15/2006,20060322,3/22/2006,"EXP",698880,"200610259BFR","BAYER PHARMACEUTICAL CORPORATION",68,"YR","M","N",,,20060321,3/21/2006,,,,,"FRANCE",
4955850,6083960,"I",72,,"4955850-X",20060321,3/21/2006,,,20060327,3/27/2006,"DIR",687382,,,59,"YR","M","N",150,"LBS",20060326,3/26/2006,,,"N","Y","UNITED STATES",
4956258,6078585,"I",72,,"4956258-3",20051101,11/1/2005,20060317,3/17/2006,20060323,3/23/2006,"EXP",698880,"2006-01033","WATSON LABORATORIES,  INC.",57,"YR","F","N",,,20060322,3/22/2006,"MD",,,,"FRANCE",7768
4956378,6107681,"I",72,,"4956378-3",20051128,11/28/2005,,,20060328,3/28/2006,"DIR",687382,,,16,"YR","M","N",172,"LBS",20060327,3/27/2006,"MD",,"N","N","UNITED STATES",7768
4956425,6106266,"I",72,,"4956425-9",20060116,1/16/2006,,,20060328,3/28/2006,"DIR",687382,,,58,"YR","M","N",155,"LBS",20060327,3/27/2006,"CN",,"N","N","UNITED STATES",6778
4956740,6008802,"F",70,,"4956740-9",20060301,3/1/2006,20060303,3/3/2006,20060329,3/29/2006,"EXP",698880,"JP-ROCHE-439653","ROCHE",86,"YR","F","Y",,,20060329,3/29/2006,"MD",20060303,,,"JAPAN",7768
4956832,6001005,"F",70,"1","4956832-4",20060210,2/10/2006,20060314,3/14/2006,20060323,3/23/2006,"EXP",698880,"EM2006-0102","CHIRON CORPORATION",7,"YR","F","N",23.6000003814697,"KG",20060321,3/21/2006,"MD",,,,"UNITED STATES",7768
4960022,6022570,"I",72,,"4960022-9",20040301,3/1/2004,20060321,3/21/2006,20060327,3/27/2006,"EXP",698880,"S06-USA-01154-01","FOREST LABORATORIES INC.",21,"YR","F","N",,,20060324,3/24/2006,"LW",20040315,,,"UNITED STATES",7687
4960255,5977401,"I",72,,"4960255-1",20050622,6/22/2005,20060322,3/22/2006,20060403,4/3/2006,"EXP",698880,"JP-JNJFOC-20050806029","CENTOCOR, INC.",,,"F","Y",,,20060403,4/3/2006,"MD",,,,"JAPAN",7768
4960256,5966962,"I",72,,"4960256-3",20060104,1/4/2006,20060322,3/22/2006,20060403,4/3/2006,"EXP",698880,"JP-JNJFOC-20060103505","CENTOCOR, INC.",,,"F","Y",55,"KG",20060403,4/3/2006,"MD",,,,"JAPAN",7768
4960257,6017360,"I",72,,"4960257-5",20051017,10/17/2005,20060324,3/24/2006,20060403,4/3/2006,"EXP",698880,"GB-JNJFOC-20060205061","CENTOCOR, INC.",,,"F","Y",84,"KG",20060403,4/3/2006,"OT",,,,"UNITED KINGDOM",7984
4960258,6017361,"I",72,,"4960258-7",20060303,3/3/2006,20060324,3/24/2006,20060403,4/3/2006,"EXP",698880,"SE-JNJFOC-20060306684","CENTOCOR, INC.",61,"YR","M","Y",,,20060403,4/3/2006,"MD",,,,"SWEDEN",7768
4960259,6017362,"I",72,,"4960259-9",20051201,12/1/2005,20060320,3/20/2006,20060403,4/3/2006,"EXP",698880,"US-JNJFOC-20060201136","CENTOCOR, INC.",,,"F","Y",78.4700012207031,"KG",20060403,4/3/2006,"OT",,,,"UNITED STATES",7984
4960260,6000486,"I",72,,"4960260-5",20060226,2/26/2006,20060322,3/22/2006,20060403,4/3/2006,"EXP",698880,"US-JNJFOC-20060300242","CENTOCOR, INC.",,,"M","Y",120.199996948242,"KG",20060403,4/3/2006,"OT",20060226,,,"UNITED STATES",7984